BDBM50089433 CHEMBL3578011
SMILES CC(C)C[C@H](NC(=O)[C@H](CCCCN)NC(C)=O)C(=O)N[C@@H](CCCNC(N)=N)C(=O)N[C@@H](Cc1cnc[nH]1)C(=O)N[C@@H](Cc1ccc(O)cc1)C(=O)N[C@@H](CC(C)C)C(=O)N[C@@H](CC(N)=O)C(=O)N[C@@H](CC(C)C)C(=O)N[C@@H](CC(C)C)C(=O)N[C@@H]([C@@H](C)O)C(=O)N[C@@H](CCCNC(N)=N)C(=O)N[C@@H](CCC(N)=O)C(=O)N[C@@H](CCCNC(N)=N)C(=O)N[C@@H](Cc1ccc(O)cc1)C(N)=O
InChI Key
Data  3 EC50
  Tab Delimited (TSV)   2D SDfile   Computed 3D by Vconf -m prep SDfile
Find this compound or compounds like it in BindingDB:
Activity Spreadsheet -- Enzyme Inhibition Constant Data from BindingDB
Found 1 hit for monomerid = 50089433
TargetGrowth hormone secretagogue receptor type 1(Homo sapiens (Human))
Universit£T Leipzig
Curated by ChEMBL
LigandPNGBDBM50089433(CHEMBL3578011)
Affinity DataEC50: >1.00E+3nM. Assay description: Inverse agonist activity at human GHSR1a receptor expressed in COS-7 cells assessed as inositol phosphate accumulation after 2 hrs by anion exchange ...
In DepthDetails ArticlePubMed